BDBM269445 (E)-3-(4-((6-hydroxy-2- (2-methylpyridin-3- yl)benzo[b]thiophen-3- yl)oxy)phenyl)acrylic acid::US10058534, 100
SMILES Cc1ncccc1-c1sc2cc(O)ccc2c1Oc1ccc(\C=C\C(O)=O)cc1
InChI Key InChIKey=NTEQIAUIPMYBNN-IZZDOVSWSA-N
Data  4 IC50
  Tab Delimited (TSV)   2D SDfile   Computed 3D by Vconf -m prep SDfile
Find this compound or compounds like it in BindingDB:
Activity Spreadsheet -- Enzyme Inhibition Constant Data from BindingDB
Found 4 hits for monomerid = 269445
TargetEstrogen receptor(Homo sapiens (Human))
Novartis
US Patent
LigandPNGBDBM269445((E)-3-(4-((6-hydroxy-2- (2-methylpyridin-3- yl)ben...)
Affinity DataIC50:  669nMpH: 5.1 T: 2°C. Assay description: The ER transcription assay is a reporter assay that is based on the ability of ER to induce transcription from a luciferase reporter gene containing ...
Ligand InfoPC cidPC sid
In DepthDetails US Patent
TargetEstrogen receptor(Homo sapiens (Human))
Novartis
US Patent
LigandPNGBDBM269445((E)-3-(4-((6-hydroxy-2- (2-methylpyridin-3- yl)ben...)
Affinity DataIC50:  669nM. Assay description: Induction of selective estrogen receptor alpha degradation in human MCF7 cells harboring TK-ERE-Luc assessed as reduction in estradiol-induced transc...
Ligand InfoPC cidPC sid
In DepthDetails ArticlePubMed
TargetEstrogen receptor(Homo sapiens (Human))
Novartis
US Patent
LigandPNGBDBM269445((E)-3-(4-((6-hydroxy-2- (2-methylpyridin-3- yl)ben...)
Affinity DataIC50:  5.40nM. Assay description: Induction of selective estrogen receptor alpha degradation in human MCF7 cells after 18 to 24 hrs by in-cell Western analysis
Ligand InfoPC cidPC sid
In DepthDetails ArticlePubMed
TargetEstrogen receptor(Homo sapiens (Human))
Novartis
US Patent
LigandPNGBDBM269445((E)-3-(4-((6-hydroxy-2- (2-methylpyridin-3- yl)ben...)
Affinity DataIC50:  5.40nMpH: 7.4 T: 2°C. Assay description: Plate MCF7 cells at 0.3 million cells/mL (100 l/well) in black, clear-bottom 96-well plates (Greiner, catalog number 655090) in DMEM/F12 media (Gibco...
Ligand InfoPC cidPC sid
In DepthDetails US Patent