BDBM269517 (1R,2S)-1-methoxy-N-(5-(6-methoxy-2-pyridinyl)-4-phenyl-4H-1,2,4-triazol-3-yl)-1-(5-methyl-2-pyrimidinyl)-2-propanesulfonamide::US10058550, Example 34.0::US10221162, Example 34.0::US9845310, Example 34.0
SMILES CO[C@@H]([C@H](C)S(=O)(=O)Nc1nnc(-c2cccc(OC)n2)n1-c1ccccc1)c1ncc(C)cn1
InChI Key InChIKey=PMYNEBIWKGULRQ-JXFKEZNVSA-N
Data  3 EC50
  Tab Delimited (TSV)   2D SDfile   Computed 3D by Vconf -m prep SDfile
Find this compound or compounds like it in BindingDB:
Activity Spreadsheet -- Enzyme Inhibition Constant Data from BindingDB
Found 3 hits for monomerid = 269517
TargetApelin receptor(Homo sapiens (Human))
Amgen
US Patent
LigandPNGBDBM269517((1R,2S)-1-methoxy-N-(5-(6-methoxy-2-pyridinyl)-4-p...)
Affinity DataEC50:  4.20nMpH: 7.5Assay Description:The human APJ receptor was cloned by polymerase chain reaction and the gene encoding the receptor was subcloned in pFLAG-CMV¿-3 expression vector (Si...
Ligand InfoPC cidPC sid
In DepthDetails US Patent
TargetApelin receptor(Homo sapiens (Human))
Amgen
US Patent
LigandPNGBDBM269517((1R,2S)-1-methoxy-N-(5-(6-methoxy-2-pyridinyl)-4-p...)
Affinity DataEC50:  4.20nM. Assay description: The human APJ receptor was cloned by polymerase chain reaction and the gene encoding the receptor was subcloned in pFLAG-CMV-3 expression vector (Sig...
Ligand InfoPC cidPC sid
In DepthDetails US Patent
TargetApelin receptor(Homo sapiens (Human))
Amgen
US Patent
LigandPNGBDBM269517((1R,2S)-1-methoxy-N-(5-(6-methoxy-2-pyridinyl)-4-p...)
Affinity DataEC50:  4.20nM. Assay description: The human APJ receptor was cloned by polymerase chain reaction and the gene encoding the receptor was subcloned in pFLAG-CMV™-3 expression vector (Si...
Ligand InfoPC cidPC sid
In DepthDetails US Patent