BDBM269527 (1R,2S)-N-(4-(2,6-dimethoxyphenyl)-5-(3-pyridinyl)-4H-1,2,4-triazol-3-yl)-1-methoxy-1-(5-methyl-2-pyrazinyl)-2-propanesulfonamide::US10058550, Example 44.0::US10221162, Example 44.0
SMILES CO[C@@H]([C@H](C)S(=O)(=O)Nc1nnc(-c2cccnc2)n1-c1c(OC)cccc1OC)c1cnc(C)cn1
InChI Key InChIKey=LNWWDEBXDFUNSN-AOMKIAJQSA-N
Data  4 EC50
  Tab Delimited (TSV)   2D SDfile   Computed 3D by Vconf -m prep SDfile
Find this compound or compounds like it in BindingDB:
Activity Spreadsheet -- Enzyme Inhibition Constant Data from BindingDB
Found 4 hits for monomerid = 269527
TargetApelin receptor(Homo sapiens (Human))
Amgen
US Patent
LigandPNGBDBM269527((1R,2S)-N-(4-(2,6-dimethoxyphenyl)-5-(3-pyridinyl)...)
Affinity DataEC50:  1.26nMpH: 7.5Assay Description:The human APJ receptor was cloned by polymerase chain reaction and the gene encoding the receptor was subcloned in pFLAG-CMV¿-3 expression vector (Si...
Ligand InfoPC cidPC sid
In DepthDetails US Patent
TargetApelin receptor(Homo sapiens (Human))
Amgen
US Patent
LigandPNGBDBM269527((1R,2S)-N-(4-(2,6-dimethoxyphenyl)-5-(3-pyridinyl)...)
Affinity DataEC50:  1.30nM. Assay description: The human APJ receptor was cloned by polymerase chain reaction and the gene encoding the receptor was subcloned in pFLAG-CMV™-3 expression vector (Si...
Ligand InfoPC cidPC sid
In DepthDetails US Patent
TargetApelin receptor(Homo sapiens (Human))
Amgen
US Patent
LigandPNGBDBM269527((1R,2S)-N-(4-(2,6-dimethoxyphenyl)-5-(3-pyridinyl)...)
Affinity DataEC50:  1.26nM. Assay description: The human APJ receptor was cloned by polymerase chain reaction and the gene encoding the receptor was subcloned in pFLAG-CMV™-3 expression vector (Si...
Ligand InfoPC cidPC sid
In DepthDetails US Patent
TargetApelin receptor(Homo sapiens (Human))
Amgen
US Patent
LigandPNGBDBM269527((1R,2S)-N-(4-(2,6-dimethoxyphenyl)-5-(3-pyridinyl)...)
Affinity DataEC50:  1.30nMpH: 7.5Assay Description:The human APJ receptor was cloned by polymerase chain reaction and the gene encoding the receptor was subcloned in pFLAG-CMV¿-3 expression vector (Si...
Ligand InfoPC cidPC sid
In DepthDetails US Patent