BDBM269533 (1R,2S)-N-(4-(2,6-dimethoxyphenyl)-5-(6-methoxy-2-pyridinyl)-4H-1,2,4-triazol-3-yl)-1-methoxy-1-(5-methoxy-2-pyrimidinyl)-2-propanesulfonamide::US10058550, Example 49.0::US10221162, Example 49.0::US9845310, Example 49.0
SMILES CO[C@@H]([C@H](C)S(=O)(=O)Nc1nnc(-c2cccc(OC)n2)n1-c1c(OC)cccc1OC)c1ncc(OC)cn1
InChI Key InChIKey=IPSIXHBQGJXPAF-NYHFZMIOSA-N
Data  3 EC50
  Tab Delimited (TSV)   2D SDfile   Computed 3D by Vconf -m prep SDfile
Find this compound or compounds like it in BindingDB:
Activity Spreadsheet -- Enzyme Inhibition Constant Data from BindingDB
Found 3 hits for monomerid = 269533
TargetApelin receptor(Homo sapiens (Human))
Amgen
US Patent
LigandPNGBDBM269533((1R,2S)-N-(4-(2,6-dimethoxyphenyl)-5-(6-methoxy-2-...)
Affinity DataEC50:  0.170nMpH: 7.5Assay Description:The human APJ receptor was cloned by polymerase chain reaction and the gene encoding the receptor was subcloned in pFLAG-CMV¿-3 expression vector (Si...
Ligand InfoPC cidPC sid
In DepthDetails US Patent
TargetApelin receptor(Homo sapiens (Human))
Amgen
US Patent
LigandPNGBDBM269533((1R,2S)-N-(4-(2,6-dimethoxyphenyl)-5-(6-methoxy-2-...)
Affinity DataEC50:  0.170nM. Assay description: The human APJ receptor was cloned by polymerase chain reaction and the gene encoding the receptor was subcloned in pFLAG-CMV-3 expression vector (Sig...
Ligand InfoPC cidPC sid
In DepthDetails US Patent
TargetApelin receptor(Homo sapiens (Human))
Amgen
US Patent
LigandPNGBDBM269533((1R,2S)-N-(4-(2,6-dimethoxyphenyl)-5-(6-methoxy-2-...)
Affinity DataEC50:  0.170nM. Assay description: The human APJ receptor was cloned by polymerase chain reaction and the gene encoding the receptor was subcloned in pFLAG-CMV™-3 expression vector (Si...
Ligand InfoPC cidPC sid
In DepthDetails US Patent