BDBM269658 (1R,2S)-N-(4-(2,6-dimethoxyphenyl)-5-(6-ethoxy-2-pyridinyl)-4H-1,2,4-triazol-3-yl)-1-methoxy-1-(5-methyl-2-pyrimidinyl)-2-propanesulfonamide::US10058550, Example 172.0::US10221162, Example 172.0::US9845310, Example 172.0
SMILES CCOc1cccc(n1)-c1nnc(NS(=O)(=O)[C@@H](C)[C@H](OC)c2ncc(C)cn2)n1-c1c(OC)cccc1OC
InChI Key InChIKey=BHYNBMWLCWXCGJ-SBUREZEXSA-N
Data  3 EC50
  Tab Delimited (TSV)   2D SDfile   Computed 3D by Vconf -m prep SDfile
Find this compound or compounds like it in BindingDB:
Activity Spreadsheet -- Enzyme Inhibition Constant Data from BindingDB
Found 3 hits for monomerid = 269658
TargetApelin receptor(Homo sapiens (Human))
Amgen
US Patent
LigandPNGBDBM269658((1R,2S)-N-(4-(2,6-dimethoxyphenyl)-5-(6-ethoxy-2-p...)
Affinity DataEC50:  0.0650nMpH: 7.5Assay Description:The human APJ receptor was cloned by polymerase chain reaction and the gene encoding the receptor was subcloned in pFLAG-CMV¿-3 expression vector (Si...
Ligand InfoPC cidPC sid
In DepthDetails US Patent
TargetApelin receptor(Homo sapiens (Human))
Amgen
US Patent
LigandPNGBDBM269658((1R,2S)-N-(4-(2,6-dimethoxyphenyl)-5-(6-ethoxy-2-p...)
Affinity DataEC50:  0.0650nM. Assay description: The human APJ receptor was cloned by polymerase chain reaction and the gene encoding the receptor was subcloned in pFLAG-CMV-3 expression vector (Sig...
Ligand InfoPC cidPC sid
In DepthDetails US Patent
TargetApelin receptor(Homo sapiens (Human))
Amgen
US Patent
LigandPNGBDBM269658((1R,2S)-N-(4-(2,6-dimethoxyphenyl)-5-(6-ethoxy-2-p...)
Affinity DataEC50:  0.0650nM. Assay description: The human APJ receptor was cloned by polymerase chain reaction and the gene encoding the receptor was subcloned in pFLAG-CMV™-3 expression vector (Si...
Ligand InfoPC cidPC sid
In DepthDetails US Patent