BDBM269879 (1S,2S)—N-(4-(2,6-dimethoxyphenyl)-5-(5-methylpyridin-3-yl)-4H-1,2,4-triazol-3-yl)-1-(2-hydroxyethoxy)-1-(5-methylpyrimidin-2-yl)propane-2-sulfonamide or (1R,2R)—N-(4-(2,6-dimethoxyphenyl)-5-(5-methylpyridin-3-yl)-4H-1,2,4-triazol-3-yl)-1-(2-hydroxyethoxy)-1-(5-methylpyrimidin-2-yl)propane-2-sulfonamide::US10058550, Example 408.0::US10058550, Example 409.0::US10221162, Example 409.0::US9845310, Example 409.0
SMILES COc1cccc(OC)c1-n1c(NS(=O)(=O)[C@H](C)[C@H](OCCO)c2ncc(C)cn2)nnc1-c1cncc(C)c1
InChI Key InChIKey=LLMANXJDGVORPO-JPYJTQIMSA-N
Data  6 EC50
  Tab Delimited (TSV)   2D SDfile   Computed 3D by Vconf -m prep SDfile
Find this compound or compounds like it in BindingDB:
Activity Spreadsheet -- Enzyme Inhibition Constant Data from BindingDB
Found 6 hits for monomerid = 269879
TargetApelin receptor(Homo sapiens (Human))
Amgen
US Patent
LigandPNGBDBM269879((1S,2S)—N-(4-(2,6-dimethoxyphenyl)-5-(5-methy...)
Affinity DataEC50:  0.880nMpH: 7.5Assay Description:The human APJ receptor was cloned by polymerase chain reaction and the gene encoding the receptor was subcloned in pFLAG-CMV¿-3 expression vector (Si...
Ligand InfoPC cidPC sid
In DepthDetails US Patent
TargetApelin receptor(Homo sapiens (Human))
Amgen
US Patent
LigandPNGBDBM269879((1S,2S)—N-(4-(2,6-dimethoxyphenyl)-5-(5-methy...)
Affinity DataEC50:  29nMpH: 7.5Assay Description:The human APJ receptor was cloned by polymerase chain reaction and the gene encoding the receptor was subcloned in pFLAG-CMV¿-3 expression vector (Si...
Ligand InfoPC cidPC sid
In DepthDetails US Patent
TargetApelin receptor(Homo sapiens (Human))
Amgen
US Patent
LigandPNGBDBM269879((1S,2S)—N-(4-(2,6-dimethoxyphenyl)-5-(5-methy...)
Affinity DataEC50:  29nM. Assay description: The human APJ receptor was cloned by polymerase chain reaction and the gene encoding the receptor was subcloned in pFLAG-CMV-3 expression vector (Sig...
Ligand InfoPC cidPC sid
In DepthDetails US Patent
TargetApelin receptor(Homo sapiens (Human))
Amgen
US Patent
LigandPNGBDBM269879((1S,2S)—N-(4-(2,6-dimethoxyphenyl)-5-(5-methy...)
Affinity DataEC50:  29nM. Assay description: The human APJ receptor was cloned by polymerase chain reaction and the gene encoding the receptor was subcloned in pFLAG-CMV™-3 expression vector (Si...
Ligand InfoPC cidPC sid
In DepthDetails US Patent
TargetApelin receptor(Homo sapiens (Human))
Amgen
US Patent
LigandPNGBDBM269879((1S,2S)—N-(4-(2,6-dimethoxyphenyl)-5-(5-methy...)
Affinity DataEC50:  0.880nM. Assay description: The human APJ receptor was cloned by polymerase chain reaction and the gene encoding the receptor was subcloned in pFLAG-CMV-3 expression vector (Sig...
Ligand InfoPC cidPC sid
In DepthDetails US Patent
TargetApelin receptor(Homo sapiens (Human))
Amgen
US Patent
LigandPNGBDBM269879((1S,2S)—N-(4-(2,6-dimethoxyphenyl)-5-(5-methy...)
Affinity DataEC50:  0.880nM. Assay description: The human APJ receptor was cloned by polymerase chain reaction and the gene encoding the receptor was subcloned in pFLAG-CMV™-3 expression vector (Si...
Ligand InfoPC cidPC sid
In DepthDetails US Patent