BDBM269940 (1R,2S)-1-(2,4-dicyanophenyl)-N-(4-(2,6-dimethoxyphenyl)-5-(6-methoxy-2-pyridinyl)-4H-1,2,4-triazol-3-yl)-1-methoxy-2-propanesulfonamide and (1S,2R)-1-(2,4-dicyanophenyl)-N-(4-(2,6-dimethoxyphenyl)-5-(6-methoxy-2-pyridinyl)-4H-1,2,4-triazol-3-yl)-1-methoxy-2-propanesulfonamide and (1R,2R)-1-(2,4-dicyanophenyl)-N-(4-(2,6-dimethoxyphenyl)-5-(6-methoxy-2-pyridinyl)-4H-1,2,4-triazol-3-yl)-1-methoxy-2-propanesulfonamide::US10058550, Example 473.0::US10221162, Example 473.0::US9845310, Example 473.0
SMILES COc1ccc(CN(Cc2ccc(OC)cc2)S(=O)(=O)[C@H](C)[C@@H](O)c2ccc(Br)cc2Br)cc1
InChI Key InChIKey=ZQRYODDLDACGDH-CRICUBBOSA-N
Data  3 EC50
  Tab Delimited (TSV)   2D SDfile   Computed 3D by Vconf -m prep SDfile
Find this compound or compounds like it in BindingDB:
Activity Spreadsheet -- Enzyme Inhibition Constant Data from BindingDB
Found 3 hits for monomerid = 269940
TargetApelin receptor(Homo sapiens (Human))
Amgen
US Patent
LigandPNGBDBM269940((1R,2S)-1-(2,4-dicyanophenyl)-N-(4-(2,6-dimethoxyp...)
Affinity DataEC50:  0.230nMpH: 7.5Assay Description:The human APJ receptor was cloned by polymerase chain reaction and the gene encoding the receptor was subcloned in pFLAG-CMV¿-3 expression vector (Si...
Ligand InfoPC cidPC sid
In DepthDetails US Patent
TargetApelin receptor(Homo sapiens (Human))
Amgen
US Patent
LigandPNGBDBM269940((1R,2S)-1-(2,4-dicyanophenyl)-N-(4-(2,6-dimethoxyp...)
Affinity DataEC50:  0.230nM. Assay description: The human APJ receptor was cloned by polymerase chain reaction and the gene encoding the receptor was subcloned in pFLAG-CMV-3 expression vector (Sig...
Ligand InfoPC cidPC sid
In DepthDetails US Patent
TargetApelin receptor(Homo sapiens (Human))
Amgen
US Patent
LigandPNGBDBM269940((1R,2S)-1-(2,4-dicyanophenyl)-N-(4-(2,6-dimethoxyp...)
Affinity DataEC50:  0.230nM. Assay description: The human APJ receptor was cloned by polymerase chain reaction and the gene encoding the receptor was subcloned in pFLAG-CMV™-3 expression vector (Si...
Ligand InfoPC cidPC sid
In DepthDetails US Patent