BDBM269948 (2S)-2-(4-cyano-2-(methylsulfonyl)phenyl)-N-(4-(2,6-dimethoxyphenyl)-5-(6-methoxy-2-pyridinyl)-4H-1,2,4-triazol-3-yl)-2-hydroxyethanesulfonamide and (2R)-2-(4-cyano-2-(methylsulfonyl)phenyl)-N-(4-(2,6-dimethoxyphenyl)-5-(6-methoxy-2-pyridinyl)-4H-1,2,4-triazol-3-yl)-2-hydroxyethanesulfonamide::US10058550, Example 481.0::US10221162, Example 481.0::US9845310, Example 481.0
SMILES COc1cccc(n1)-c1nnc(N(CC[Si](C)(C)C)S(=O)(=O)C[C@@H](O)c2ccc(Cl)cc2S(C)(=O)=O)n1-c1c(OC)cccc1OC
InChI Key InChIKey=VIPBBGZRLNONLD-HSZRJFAPSA-N
Data  3 EC50
  Tab Delimited (TSV)   2D SDfile   Computed 3D by Vconf -m prep SDfile
Find this compound or compounds like it in BindingDB:
Activity Spreadsheet -- Enzyme Inhibition Constant Data from BindingDB
Found 3 hits for monomerid = 269948
TargetApelin receptor(Homo sapiens (Human))
Amgen
US Patent
LigandPNGBDBM269948((2S)-2-(4-cyano-2-(methylsulfonyl)phenyl)-N-(4-(2,...)
Affinity DataEC50:  0.240nMpH: 7.5Assay Description:The human APJ receptor was cloned by polymerase chain reaction and the gene encoding the receptor was subcloned in pFLAG-CMV¿-3 expression vector (Si...
Ligand InfoPC cidPC sid
In DepthDetails US Patent
TargetApelin receptor(Homo sapiens (Human))
Amgen
US Patent
LigandPNGBDBM269948((2S)-2-(4-cyano-2-(methylsulfonyl)phenyl)-N-(4-(2,...)
Affinity DataEC50:  0.240nM. Assay description: The human APJ receptor was cloned by polymerase chain reaction and the gene encoding the receptor was subcloned in pFLAG-CMV-3 expression vector (Sig...
Ligand InfoPC cidPC sid
In DepthDetails US Patent
TargetApelin receptor(Homo sapiens (Human))
Amgen
US Patent
LigandPNGBDBM269948((2S)-2-(4-cyano-2-(methylsulfonyl)phenyl)-N-(4-(2,...)
Affinity DataEC50:  0.240nM. Assay description: The human APJ receptor was cloned by polymerase chain reaction and the gene encoding the receptor was subcloned in pFLAG-CMV™-3 expression vector (Si...
Ligand InfoPC cidPC sid
In DepthDetails US Patent