BDBM270177 (1R,2R)-1-(5-chloro-2-pyridinyl)-N-(4-(2,6-dimethoxyphenyl)-5-(5-methyl-3-pyridinyl)-4H-1,2,4-triazol-3-yl)-1-(1-methylethoxy)-2-propanesulfonamide, (1S,2S)-1-(5-chloro-2-pyridinyl)-N-(4-(2,6-dimethoxyphenyl)-5-(5-methyl-3-pyridinyl)-4H-1,2,4-triazol-3-yl)-1-(1-methylethoxy)-2-propanesulfonamide::US10058550, Example 745.0::US10221162, Example 744.0::US9845310, Example 745.0
SMILES COc1cccc(OC)c1-n1c(NS(=O)(=O)[C@H](C)[C@H](OC(C)C)c2ccc(Cl)cn2)nnc1-c1cncc(C)c1
InChI Key InChIKey=FRZKRABRPPRYFV-CJAUYULYSA-N
Data  4 EC50
  Tab Delimited (TSV)   2D SDfile   Computed 3D by Vconf -m prep SDfile
Find this compound or compounds like it in BindingDB:
Activity Spreadsheet -- Enzyme Inhibition Constant Data from BindingDB
Found 4 hits for monomerid = 270177
TargetApelin receptor(Homo sapiens (Human))
Amgen
US Patent
LigandPNGBDBM270177((1R,2R)-1-(5-chloro-2-pyridinyl)-N-(4-(2,6-dimetho...)
Affinity DataEC50:  0.400nMpH: 7.5Assay Description:The human APJ receptor was cloned by polymerase chain reaction and the gene encoding the receptor was subcloned in pFLAG-CMV¿-3 expression vector (Si...
Ligand InfoPC cidPC sid
In DepthDetails US Patent
TargetApelin receptor(Homo sapiens (Human))
Amgen
US Patent
LigandPNGBDBM270177((1R,2R)-1-(5-chloro-2-pyridinyl)-N-(4-(2,6-dimetho...)
Affinity DataEC50:  0.400nM. Assay description: The human APJ receptor was cloned by polymerase chain reaction and the gene encoding the receptor was subcloned in pFLAG-CMV-3 expression vector (Sig...
Ligand InfoPC cidPC sid
In DepthDetails US Patent
TargetApelin receptor(Homo sapiens (Human))
Amgen
US Patent
LigandPNGBDBM270177((1R,2R)-1-(5-chloro-2-pyridinyl)-N-(4-(2,6-dimetho...)
Affinity DataEC50:  26nM. Assay description: The human APJ receptor was cloned by polymerase chain reaction and the gene encoding the receptor was subcloned in pFLAG-CMV-3 expression vector (Sig...
Ligand InfoPC cidPC sid
In DepthDetails US Patent
TargetApelin receptor(Homo sapiens (Human))
Amgen
US Patent
LigandPNGBDBM270177((1R,2R)-1-(5-chloro-2-pyridinyl)-N-(4-(2,6-dimetho...)
Affinity DataEC50:  26nM. Assay description: The human APJ receptor was cloned by polymerase chain reaction and the gene encoding the receptor was subcloned in pFLAG-CMV™-3 expression vector (Si...
Ligand InfoPC cidPC sid
In DepthDetails US Patent