BDBM27026 2-[(3S,13S,16S,17R,19S)-3-({[(2S)-1-[(dimethylsulfamoyl)(methyl)amino]-3,3-dimethylbutan-2-yl]carbamoyl}amino)-18,18-dimethyl-2,15-dioxo-1,14-diazatricyclo[14.4.0.0^{17,19}]icosan-13-yl]-2-oxo-N-(prop-2-en-1-yl)acetamide::ketoamide derived macrocyclic inhibitor, 50
SMILES CN(C)S(=O)(=O)N(C)C[C@@H](NC(=O)N[C@H]1CCCCCCCCC[C@H](NC(=O)[C@@H]2[C@@H]3[C@H](CN2C1=O)C3(C)C)C(=O)C(=O)NCC=C)C(C)(C)C
InChI Key InChIKey=ZRJWAVAFJOLRCZ-XDHPVKSMSA-N
Data  1 KI
  Tab Delimited (TSV)   2D SDfile   Computed 3D by Vconf -m prep SDfile
Find this compound or compounds like it in BindingDB:
Activity Spreadsheet -- Enzyme Inhibition Constant Data from BindingDB
Found 1 hit for monomerid = 27026
TargetGenome polyprotein(Hepatitis C virus (HCV genotype 1a, isolate H))
Schering-Plough Research Institute
LigandPNGBDBM27026(2-[(3S,13S,16S,17R,19S)-3-({[(2S)-1-[(dimethylsulf...)
Affinity DataKi:  13nM. Assay description: Proteolytic cleavage of the ester linkage between the Nva (L-norvaline) and the chromophore (PAP) was monitored for change in absorbance at 370 nm. I...
In DepthDetails ArticlePubMed