BDBM270284 (S)-3-(3-((6-(2,5-bis(trifluoromethyl)benzyl)-6-azaspiro[3.4]octan-2-yl)oxy)phenyl)-3-cyclopropylpropanoic acid::US10059667, Example 5B
SMILES OC(=O)C[C@@H](C1CC1)c1cccc(O[C@H]2CC3(C2)CCN(Cc2cc(ccc2C(F)(F)F)C(F)(F)F)C3)c1
InChI Key InChIKey=BJUYOUIXZQXLJQ-XAWUTYGVSA-N
Data  2 EC50
  Tab Delimited (TSV)   2D SDfile   Computed 3D by Vconf -m prep SDfile
Find this compound or compounds like it in BindingDB:
Activity Spreadsheet -- Enzyme Inhibition Constant Data from BindingDB
Found 2 hits for monomerid = 270284
TargetFree fatty acid receptor 1(Homo sapiens (Human))
Merck Sharp & Dohme
US Patent
LigandPNGBDBM270284((S)-3-(3-((6-(2,5-bis(trifluoromethyl)benzyl)-6-az...)
Affinity DataEC50:  2.14E+3nMT: 2°C. Assay description: The assay was performed in 96-well format. HEK cells stably expressing human GPR40 were plated to be 60-80% confluent within 72 h. After 72 h, the pl...
Ligand InfoPC cidPC sid
In DepthDetails US Patent
TargetFree fatty acid receptor 1(Homo sapiens (Human))
Merck Sharp & Dohme
US Patent
LigandPNGBDBM270284((S)-3-(3-((6-(2,5-bis(trifluoromethyl)benzyl)-6-az...)
Affinity DataEC50:  113nMpH: 7.4 T: 2°C. Assay description: FLIPR (Fluorimetric Imaging Plate Reader, Molecular Devices) assays were performed to measure agonist-induced calcium mobilization of the stable clon...
Ligand InfoPC cidPC sid
In DepthDetails US Patent