BDBM27046 4-cyclobutyl-3-{[(1R,2S,5S)-3-[(2S)-2-({[(2S)-1-(1,1-dioxo-2,3-dihydro-1,2-benzothiazol-2-yl)-3,3-dimethylbutan-2-yl]carbamoyl}amino)-3,3-dimethylbutanoyl]-6,6-dimethyl-3-azabicyclo[3.1.0]hexan-2-yl]formamido}-2-oxo-N-(prop-2-en-1-yl)butanamide::bicyclic sultam derivative, 30
SMILES CC(C)(C)[C@@H](CN1Cc2ccccc2S1(=O)=O)NC(=O)N[C@H](C(=O)N1C[C@H]2[C@@H]([C@H]1C(=O)NC(CC1CCC1)C(=O)C(=O)NCC=C)C2(C)C)C(C)(C)C
InChI Key InChIKey=WCVIOJGMXRQBSA-UCHUKXEDSA-N
Data  1 KI
  Tab Delimited (TSV)   2D SDfile   Computed 3D by Vconf -m prep SDfile
Find this compound or compounds like it in BindingDB:
Activity Spreadsheet -- Enzyme Inhibition Constant Data from BindingDB
Found 1 hit for monomerid = 27046
TargetGenome polyprotein(Hepatitis C virus (HCV genotype 1a, isolate H))
Schering-Plough Research Institute
LigandPNGBDBM27046(4-cyclobutyl-3-{[(1R,2S,5S)-3-[(2S)-2-({[(2S)-1-(1...)
Affinity DataKi:  30nM ΔG°:  -10.4kcal/molepH: 6.5 T: 2°C. Assay description: Proteolytic cleavage of the ester linkage between the Nva (L-norvaline) and the chromophore (PAP) was monitored for change in absorbance at 370 nm. I...
In DepthDetails ArticlePubMed