BDBM270922 7-(benzenesulfonyl)-4-(cyclohex-1-en-1-yl)-2-ethyl-5H-pyrrolo[3,2-d]pyrimidin-6-amine::US10059713, Example 41
SMILES CCc1nc(C2=CCCCC2)c2[nH]c(N)c(c2n1)S(=O)(=O)c1ccccc1
InChI Key InChIKey=FYVHJOGNKAMKAM-UHFFFAOYSA-N
Data  1 EC50
  Tab Delimited (TSV)   2D SDfile   Computed 3D by Vconf -m prep SDfile
Find this compound or compounds like it in BindingDB:
Activity Spreadsheet -- Enzyme Inhibition Constant Data from BindingDB
Found 1 hit for monomerid = 270922
TargetFree fatty acid receptor 2(Homo sapiens (Human))
Takeda Pharmaceutical
US Patent
LigandPNGBDBM270922(7-(benzenesulfonyl)-4-(cyclohex-1-en-1-yl)-2-ethyl...)
Affinity DataEC50:  55nM. Assay description: GPR43 agonist/PAM activity was determined by measuring changes in intracellular calcium levels using a Ca2+ sensitive fluorescent dye. The changes in...
Ligand InfoPC cidPC sid
In DepthDetails US Patent