BDBM270984 7-(benzenesulfonyl)-4-{6-oxa-9-azaspiro[4.5]decan-9-yl}-5H-pyrrolo[3,2-d]pyrimidin-6-amine::US10059713, Example 102
SMILES Nc1[nH]c2c(ncnc2c1S(=O)(=O)c1ccccc1)N1CCOC2(CCCC2)C1
InChI Key InChIKey=WAGPENIWGUQZBL-UHFFFAOYSA-N
Data  1 EC50
  Tab Delimited (TSV)   2D SDfile   Computed 3D by Vconf -m prep SDfile
Find this compound or compounds like it in BindingDB:
Activity Spreadsheet -- Enzyme Inhibition Constant Data from BindingDB
Found 1 hit for monomerid = 270984
TargetFree fatty acid receptor 2(Homo sapiens (Human))
Takeda Pharmaceutical
US Patent
LigandPNGBDBM270984(7-(benzenesulfonyl)-4-{6-oxa-9-azaspiro[4.5]decan-...)
Affinity DataEC50:  18nM. Assay description: GPR43 agonist/PAM activity was determined by measuring changes in intracellular calcium levels using a Ca2+ sensitive fluorescent dye. The changes in...
Ligand InfoPC cidPC sid
In DepthDetails US Patent