BDBM271121 7-(benzenesulfonyl)-2-methyl-4-(propan-2-yloxy)-5H-pyrrolo[3,2-d]pyrimidin-6-amine::US10059713, Example 242
SMILES CC(C)Oc1nc(C)nc2c(c(N)[nH]c12)S(=O)(=O)c1ccccc1
InChI Key InChIKey=HIENHCNRRPMKDA-UHFFFAOYSA-N
Data  1 EC50
  Tab Delimited (TSV)   2D SDfile   Computed 3D by Vconf -m prep SDfile
Find this compound or compounds like it in BindingDB:
Activity Spreadsheet -- Enzyme Inhibition Constant Data from BindingDB
Found 1 hit for monomerid = 271121
TargetFree fatty acid receptor 2(Homo sapiens (Human))
Takeda Pharmaceutical
US Patent
LigandPNGBDBM271121(7-(benzenesulfonyl)-2-methyl-4-(propan-2-yloxy)-5H...)
Affinity DataEC50:  2nM. Assay description: GPR43 agonist/PAM activity was determined by measuring changes in intracellular calcium levels using a Ca2+ sensitive fluorescent dye. The changes in...
Ligand InfoPC cidPC sid
In DepthDetails US Patent