BDBM271179 7-(2-fluorobenzenesulfonyl)-N2-methyl-4-(2-methylmorpholin-4-yl)-5H-pyrrolo[3,2-d]pyrimidine-2,6-diamine::US10059713, Example 298
SMILES CNc1nc(N2CCOC(C)C2)c2[nH]c(N)c(c2n1)S(=O)(=O)c1ccccc1F
InChI Key
Data  1 EC50
  Tab Delimited (TSV)   2D SDfile   Computed 3D by Vconf -m prep SDfile
Find this compound or compounds like it in BindingDB:
Activity Spreadsheet -- Enzyme Inhibition Constant Data from BindingDB
Found 1 hit for monomerid = 271179
TargetFree fatty acid receptor 2(Homo sapiens (Human))
Takeda Pharmaceutical
US Patent
LigandPNGBDBM271179(7-(2-fluorobenzenesulfonyl)-N2-methyl-4-(2-methylm...)
Affinity DataEC50:  1nM. Assay description: GPR43 agonist/PAM activity was determined by measuring changes in intracellular calcium levels using a Ca2+ sensitive fluorescent dye. The changes in...
Ligand InfoPC cidPC sid
In DepthDetails US Patent