BDBM271269 US10059720, Example 84::US10975091, Example 84
SMILES C[C@H]1CC[C@@H](CC1)Oc1ccnc(C[C@@](O)([C@@H](N)COc2ccc(F)cn2)C(O)=O)c1
InChI Key InChIKey=AOFAGXGTSSPBTM-JLHDJQRBSA-N
Data  4 IC50
  Tab Delimited (TSV)   2D SDfile   Computed 3D by Vconf -m prep SDfile
Find this compound or compounds like it in BindingDB:
Activity Spreadsheet -- Enzyme Inhibition Constant Data from BindingDB
Found 4 hits for monomerid = 271269
TargetLeucyl-cystinyl aminopeptidase(Rattus norvegicus)
Astellas Pharma
US Patent
LigandPNGBDBM271269(US10059720, Example 84 | US10975091, Example 84)
Affinity DataIC50:  2.70nM. Assay description: Rat epididymal fat pads were homogenized and subjected to ultracentrifugation at 100,000×g for 30 minutes to obtain microsomes containing IRAP. The m...
Ligand InfoPC cidPC sid
In DepthDetails US Patent
TargetLeucyl-cystinyl aminopeptidase(Homo sapiens (Human))
Astellas Pharma
US Patent
LigandPNGBDBM271269(US10059720, Example 84 | US10975091, Example 84)
Affinity DataIC50:  3.70nM. Assay description: hP-LAP: HEK293 cells forced to transiently express hP-LAP were prepared by lipofection, homogenized, and then subjected to ultracentrifugation at 100...
Ligand InfoPC cidPC sid
In DepthDetails US Patent
TargetLeucyl-cystinyl aminopeptidase(Rattus norvegicus)
Astellas Pharma
US Patent
LigandPNGBDBM271269(US10059720, Example 84 | US10975091, Example 84)
Affinity DataIC50:  2.70nM. Assay description: IRAP: Rat epididymal fat pads were homogenized and subjected to ultracentrifugation at 100,000×g for 30 minutes to obtain microsomes containing IRAP....
Ligand InfoPC cidPC sid
In DepthDetails US Patent
TargetLeucyl-cystinyl aminopeptidase(Homo sapiens (Human))
Astellas Pharma
US Patent
LigandPNGBDBM271269(US10059720, Example 84 | US10975091, Example 84)
Affinity DataIC50:  3.70nM. Assay description: HEK293 cells forced to transiently express hP-LAP (J Biol Chem 1996; 271: 56-61) were prepared by lipofection, homogenized, and then subjected to ult...
Ligand InfoPC cidPC sid
In DepthDetails US Patent