BDBM271360 US10064861, Compound 15
SMILES COc1ccc2Cn3c(NC(=O)c4cccc(Cn5nc(ccc5=O)-c1c2)c4)nc1ccccc31
InChI Key InChIKey=CFPHRAGDOWGLBX-UHFFFAOYSA-N
Data  2 IC50
  Tab Delimited (TSV)   2D SDfile   Computed 3D by Vconf -m prep SDfile
Find this compound or compounds like it in BindingDB:
Activity Spreadsheet -- Enzyme Inhibition Constant Data from BindingDB
Found 2 hits for monomerid = 271360
TargetInterleukin-1 receptor-associated kinase 4(Homo sapiens (Human))
Merck Patent
US Patent
LigandPNGBDBM271360(US10064861, Compound 15)
Affinity DataIC50: <100nMpH: 7.0Assay Description:IRAK4 is a human purified recombinant enzyme (His-TEV-IRAK1 (194-712) IRAK4 hydrolyses ATP, autophosphorylates and phosphorylates a Serine/Threonine ...
Ligand InfoPC cidPC sid
In DepthDetails US Patent
TargetInterleukin-1 receptor-associated kinase 1(Homo sapiens (Human))
Merck Patent
US Patent
LigandPNGBDBM271360(US10064861, Compound 15)
Affinity DataIC50: <100nMpH: 7.0Assay Description:IRAK1 is a human purified recombinant enzyme (His-TEV-IRAK1 (194-712)) In this assay, IRAK-1 hydrolyses ATP and autophosphorylates.Measurement of IRA...
Ligand InfoPC cidPC sid
In DepthDetails US Patent