BDBM271378 US10064861, Compound 32b
SMILES O[C@H]1Cn2c(NC(=O)c3cccc(Cn4nc(ccc4=O)N4CCC[C@H]1C4)c3)nc1ccccc21
InChI Key InChIKey=MEDMHQINGWSSFJ-UGKGYDQZSA-N
Data  2 IC50
  Tab Delimited (TSV)   2D SDfile   Computed 3D by Vconf -m prep SDfile
Find this compound or compounds like it in BindingDB:
Activity Spreadsheet -- Enzyme Inhibition Constant Data from BindingDB
Found 2 hits for monomerid = 271378
TargetInterleukin-1 receptor-associated kinase 4(Homo sapiens (Human))
Merck Patent
US Patent
LigandPNGBDBM271378(US10064861, Compound 32b)
Affinity DataIC50: <100nMpH: 7.0Assay Description:IRAK4 is a human purified recombinant enzyme (His-TEV-IRAK1 (194-712) IRAK4 hydrolyses ATP, autophosphorylates and phosphorylates a Serine/Threonine ...
Ligand InfoPC cidPC sid
In DepthDetails US Patent
TargetInterleukin-1 receptor-associated kinase 1(Homo sapiens (Human))
Merck Patent
US Patent
LigandPNGBDBM271378(US10064861, Compound 32b)
Affinity DataIC50: <100nMpH: 7.0Assay Description:IRAK1 is a human purified recombinant enzyme (His-TEV-IRAK1 (194-712)) In this assay, IRAK-1 hydrolyses ATP and autophosphorylates.Measurement of IRA...
Ligand InfoPC cidPC sid
In DepthDetails US Patent