BDBM27145 2-(4-methylazepan-4-yl)-1H-1,3-benzodiazole-4-carboxamide::benzimidazole carboxamide, 10a
SMILES CC1(CCCNCC1)c1nc2cccc(C(N)=O)c2[nH]1
InChI Key InChIKey=IGALKCLCCJJLOJ-UHFFFAOYSA-N
Data  1 KI
  Tab Delimited (TSV)   2D SDfile   Computed 3D by Vconf -m prep SDfile
Find this compound or compounds like it in BindingDB:
Activity Spreadsheet -- Enzyme Inhibition Constant Data from BindingDB
Found 1 hit for monomerid = 27145
TargetPoly [ADP-ribose] polymerase 1(Homo sapiens (Human))
Abbott Laboratories
LigandPNGBDBM27145(2-(4-methylazepan-4-yl)-1H-1,3-benzodiazole-4-carb...)
Affinity DataKi:  3nM ΔG°:  -11.5kcal/molepH: 8.0 T: 2°C. Assay description: PARP assays utilizing SPA bead-based detection were carried out in 96-well plates. After reaction was terminated, the reaction mixtures were transfer...
In DepthDetails ArticlePubMed