BDBM271482 2-(7-(3-chloro-4-fluorophenoxy)-4-hydroxy-1-methyl-2-oxo-1,2-dihydroquinoline-3-carboxamido)acetic acid::US10065928, Example 29
SMILES Cn1c2cc(Oc3ccc(F)c(Cl)c3)ccc2c(O)c(C(=O)NCC(O)=O)c1=O
InChI Key InChIKey=KIHXHRZAADSDBD-UHFFFAOYSA-N
Data  1 EC50
  Tab Delimited (TSV)   2D SDfile   Computed 3D by Vconf -m prep SDfile
Find this compound or compounds like it in BindingDB:
Activity Spreadsheet -- Enzyme Inhibition Constant Data from BindingDB
Found 1 hit for monomerid = 271482
TargetHypoxia-inducible factor 1-alpha(Homo sapiens (Human))
Sunshine Lake Pharma
US Patent
LigandPNGBDBM271482(2-(7-(3-chloro-4-fluorophenoxy)-4-hydroxy-1-methyl...)
Affinity DataEC50:  1.02E+4nM. Assay description: The activities of compounds of the invention in inducing erythropoietin (EPO) production were assessed by using human live cancer cell strain Hep3B (...
Ligand InfoPC cidPC sid
In DepthDetails US Patent