BDBM271505 US10065941, Compound I-006::US9732060, Compound I-006
SMILES CC(C)(Cn1c(=O)[nH]\c(=N/c2ccc(Oc3ccc(Cl)cn3)cc2)n(Cc2ccc(Cl)cc2)c1=O)C(O)=O
InChI Key InChIKey=UXDHDBKZQYVJSB-UHFFFAOYSA-N
Data  2 IC50
  Tab Delimited (TSV)   2D SDfile   Computed 3D by Vconf -m prep SDfile
Find this compound or compounds like it in BindingDB:
Activity Spreadsheet -- Enzyme Inhibition Constant Data from BindingDB
Found 2 hits for monomerid = 271505
TargetP2X purinoceptor 3(Homo sapiens (Human))
Shionogi
US Patent
LigandPNGBDBM271505(US10065941, Compound I-006 | US9732060, Compound I...)
Affinity DataIC50:  5nM. Assay description: Stably expressing cell line (C6BU-1 cell transfected with human P2X3 receptor gene (GenBank accession number Y07683) was used. The cells were seeded ...
Ligand InfoPC cidPC sid
In DepthDetails US Patent
TargetP2X purinoceptor 3(Homo sapiens (Human))
Shionogi
US Patent
LigandPNGBDBM271505(US10065941, Compound I-006 | US9732060, Compound I...)
Affinity DataIC50:  5nMpH: 7.5Assay Description:Stably expressing cell line (C6BU-1 cell transfected with human P2X3 receptor gene (GenBank accession number Y07683) was used. The cells were seeded ...
Ligand InfoPC cidPC sid
In DepthDetails US Patent