BDBM27198 4-cyano-N-methyl-N-[(1R,2S,5S,6S,9R,12S,13R,16S)-6,7,13-trimethyl-7-azapentacyclo[10.8.0.0^{2,9}.0^{5,9}.0^{13,18}]icos-18-en-16-yl]benzamide::Conessine analogue, 12d
SMILES [H][C@@]1(C)N(C)C[C@]23CC[C@@]4([H])[C@@]([H])(CC=C5C[C@H](CC[C@]45C)N(C)C(=O)c4ccc(cc4)C#N)[C@]2([H])CC[C@]13[H]
InChI Key InChIKey=BGHMFFCWINSZMO-YTLNYRDXSA-N
Data  2 KI
  Tab Delimited (TSV)   2D SDfile   Computed 3D by Vconf -m prep SDfile
Find this compound or compounds like it in BindingDB:
Activity Spreadsheet -- Enzyme Inhibition Constant Data from BindingDB
Found 2 hits for monomerid = 27198
TargetHistamine H3 receptor(Homo sapiens (Human))
Abbott Laboratories
LigandPNGBDBM27198(4-cyano-N-methyl-N-[(1R,2S,5S,6S,9R,12S,13R,16S)-6...)
Affinity DataKi:  39.8nM ΔG°:  -10.1kcal/molepH: 7.4 T: 2°C. Assay description: Competition radioligand binding assays were performed with increasing concentrations of test compound in the presence of [3H]ligand. All binding reac...
In DepthDetails ArticlePubMed
TargetHistamine H3 receptor(Rattus norvegicus (rat))
Abbott Laboratories
LigandPNGBDBM27198(4-cyano-N-methyl-N-[(1R,2S,5S,6S,9R,12S,13R,16S)-6...)
Affinity DataKi:  195nM. Assay description: Competition radioligand binding assays were performed with increasing concentrations of test compound in the presence of [3H]ligand. All binding reac...
In DepthDetails ArticlePubMed