BDBM272054 US10065941, Compound I-275::US9732060, Compound I-275
SMILES CCc1ccc(Oc2ccc(cc2)\N=c2/[nH]c(=O)n(C[C@H](C)C(O)=O)c(=O)n2Cc2ccc(C)cc2)nc1
InChI Key
Data  2 IC50
  Tab Delimited (TSV)   2D SDfile   Computed 3D by Vconf -m prep SDfile
Find this compound or compounds like it in BindingDB:
Activity Spreadsheet -- Enzyme Inhibition Constant Data from BindingDB
Found 2 hits for monomerid = 272054
TargetP2X purinoceptor 3(Homo sapiens (Human))
Shionogi
US Patent
LigandPNGBDBM272054(US10065941, Compound I-275 | US9732060, Compound I...)
Affinity DataIC50:  4nM. Assay description: Stably expressing cell line (C6BU-1 cell transfected with human P2X3 receptor gene (GenBank accession number Y07683) was used. The cells were seeded ...
Ligand InfoPC cidPC sid
In DepthDetails US Patent
TargetP2X purinoceptor 3(Homo sapiens (Human))
Shionogi
US Patent
LigandPNGBDBM272054(US10065941, Compound I-275 | US9732060, Compound I...)
Affinity DataIC50:  4nMpH: 7.5Assay Description:Stably expressing cell line (C6BU-1 cell transfected with human P2X3 receptor gene (GenBank accession number Y07683) was used. The cells were seeded ...
Ligand InfoPC cidPC sid
In DepthDetails US Patent