BDBM272110 2-Cyclopropyl-6-(3-fluoro-2-methylphenyl)-N- hydroxy-5,6,7,8-tetrahydroquinazoline-6-carboxamide::US10065948, 46
SMILES Cc1c(F)cccc1C1(CCc2nc(ncc2C1)C1CC1)C(=O)NO
InChI Key InChIKey=FVWZIGMWHWTXQX-UHFFFAOYSA-N
Data  1 IC50
  Tab Delimited (TSV)   2D SDfile   Computed 3D by Vconf -m prep SDfile
Find this compound or compounds like it in BindingDB:
Activity Spreadsheet -- Enzyme Inhibition Constant Data from BindingDB
Found 1 hit for monomerid = 272110
TargetHistone deacetylase 9(Homo sapiens (Human))
Chdi Foundation
US Patent
LigandPNGBDBM272110(2-Cyclopropyl-6-(3-fluoro-2-methylphenyl)-N- hydro...)
Affinity DataIC50:  1.60E+3nM. Assay description: The potency of the compounds is quantified by measuring the Histone Deacetylase 9 (HDAC9) enzymatic activity using the fluorogenic substrate, Boc-Lys...
Ligand InfoPC cidPC sid
In DepthDetails US Patent