BDBM272151 E1-(abs)-N-Hydroxy-1-phenyl-2,3-dihydro-1H-indene- 1-carboxamide::US10065948, 87::US10457675, Example 87
SMILES ONC(=O)[C@@]1(CCc2ccccc12)c1ccccc1
InChI Key InChIKey=OBPZTPAVNIINFT-INIZCTEOSA-N
Data  2 IC50
  Tab Delimited (TSV)   2D SDfile   Computed 3D by Vconf -m prep SDfile
Find this compound or compounds like it in BindingDB:
Activity Spreadsheet -- Enzyme Inhibition Constant Data from BindingDB
Found 2 hits for monomerid = 272151
TargetHistone deacetylase 9(Homo sapiens (Human))
Chdi Foundation
US Patent
LigandPNGBDBM272151(E1-(abs)-N-Hydroxy-1-phenyl-2,3-dihydro-1H-indene-...)
Affinity DataIC50:  5.67E+3nM. Assay description: The potency of the compounds is quantified by measuring the Histone Deacetylase 9 (HDAC9) enzymatic activity using the fluorogenic substrate, Boc-Lys...
Ligand InfoPC cidPC sid
In DepthDetails US Patent
TargetHistone deacetylase 9(Homo sapiens (Human))
Chdi Foundation
US Patent
LigandPNGBDBM272151(E1-(abs)-N-Hydroxy-1-phenyl-2,3-dihydro-1H-indene-...)
Affinity DataIC50:  5.67E+3nM. Assay description: The potency of the compounds is quantified by measuring the Histone Deacetylase 9 (HDAC9) enzymatic activity using the fluorogenic substrate, Boc-Lys...
Ligand InfoPC cidPC sid
In DepthDetails US Patent