BDBM272303 US10065950, Example 145::US10065950, Example 146
SMILES CCC(C)N1[C@H](COC)Cn2cc(-c3nnc(Cc4ccc(F)cc4F)s3)c(=O)c(O)c2C1=O
InChI Key InChIKey=JMAPWOPLUATWIB-CVRLYYSRSA-N
Data  2 IC50
  Tab Delimited (TSV)   2D SDfile   Computed 3D by Vconf -m prep SDfile
Find this compound or compounds like it in BindingDB:
Activity Spreadsheet -- Enzyme Inhibition Constant Data from BindingDB
Found 2 hits for monomerid = 272303
TargetVirion infectivity factor(Human immunodeficiency virus type 1 group M subtyp...)
Japan Tobacco
US Patent
LigandPNGBDBM272303(US10065950, Example 145 | US10065950, Example 146)
Affinity DataIC50:  5.90nMT: 2°C. Assay description: The donor DNA was diluted with TE buffer to 20 nM, of which 50 μL was added to each well of streptavidin-coated black plate (manufactured by PIA...
Ligand InfoPC cidPC sid
In DepthDetails US Patent
TargetVirion infectivity factor(Human immunodeficiency virus type 1 group M subtyp...)
Japan Tobacco
US Patent
LigandPNGBDBM272303(US10065950, Example 145 | US10065950, Example 146)
Affinity DataIC50:  5.60nMT: 2°C. Assay description: The donor DNA was diluted with TE buffer to 20 nM, of which 50 μL was added to each well of streptavidin-coated black plate (manufactured by PIA...
Ligand InfoPC cidPC sid
In DepthDetails US Patent