BDBM272547 3-(2-methylpyridin-4-yl)-5,6-dihydro-1H-pyrazolo[4,3-g]quinazolin-7(8H)-one::US10065967, Example 13::US10759805, Ex 13::US9745307, Example 13
SMILES Cc1cc(ccn1)-c1n[nH]c2cc3NC(=O)NCc3cc12
InChI Key InChIKey=FEIJZJGMKBIZGG-UHFFFAOYSA-N
Data  3 IC50
  Tab Delimited (TSV)   2D SDfile   Computed 3D by Vconf -m prep SDfile
Find this compound or compounds like it in BindingDB:
Activity Spreadsheet -- Enzyme Inhibition Constant Data from BindingDB
Found 3 hits for monomerid = 272547
TargetMitogen-activated protein kinase 1(Homo sapiens (Human))
Merck Sharp & Dohme
US Patent
LigandPNGBDBM272547(3-(2-methylpyridin-4-yl)-5,6-dihydro-1H-pyrazolo[4...)
Affinity DataIC50:  0.600nM. Assay description: Activated ERK2 activity was determined in an IMAP-FP assay (Molecular Devices). Using this assay format, the potency (IC50) of each compound was dete...
Ligand InfoPC cidPC sid
In DepthDetails US Patent
TargetMitogen-activated protein kinase 1(Homo sapiens (Human))
Merck Sharp & Dohme
US Patent
LigandPNGBDBM272547(3-(2-methylpyridin-4-yl)-5,6-dihydro-1H-pyrazolo[4...)
Affinity DataIC50:  600nM. Assay description: Human: Activated ERK2 activity was determined in an IMAP-FP assay (Molecular Devices). Using this assay format, the potency (IC50) of each compound w...
Ligand InfoPC cidPC sid
In DepthDetails US Patent
TargetMitogen-activated protein kinase 1(Homo sapiens (Human))
Merck Sharp & Dohme
US Patent
LigandPNGBDBM272547(3-(2-methylpyridin-4-yl)-5,6-dihydro-1H-pyrazolo[4...)
Affinity DataIC50:  0.600nM. Assay description: Activated ERK2 activity was determined in an IMAP-FP assay (Molecular Devices). Using this assay format, the potency (IC50) of each compound was dete...
Ligand InfoPC cidPC sid
In DepthDetails US Patent