BDBM272568 (R)-3-amino-6-(1-phenylethyl)-5,6-dihydro-1H-pyrazolo[4,3-g]quinazolin-7(8H)-one::US10065967, Example 32::US10759805, Ex 32::US9745307, Example 44
SMILES C[C@@H](N1Cc2cc3c(N)n[nH]c3cc2NC1=O)c1ccccc1
InChI Key
Data  3 IC50
  Tab Delimited (TSV)   2D SDfile   Computed 3D by Vconf -m prep SDfile
Find this compound or compounds like it in BindingDB:
Activity Spreadsheet -- Enzyme Inhibition Constant Data from BindingDB
Found 3 hits for monomerid = 272568
TargetMitogen-activated protein kinase 1(Homo sapiens (Human))
Merck Sharp & Dohme
US Patent
LigandPNGBDBM272568((R)-3-amino-6-(1-phenylethyl)-5,6-dihydro-1H-pyraz...)
Affinity DataIC50:  21nM. Assay description: Activated ERK2 activity was determined in an IMAP-FP assay (Molecular Devices). Using this assay format, the potency (IC50) of each compound was dete...
Ligand InfoPC cidPC sid
In DepthDetails US Patent
TargetMitogen-activated protein kinase 1(Homo sapiens (Human))
Merck Sharp & Dohme
US Patent
LigandPNGBDBM272568((R)-3-amino-6-(1-phenylethyl)-5,6-dihydro-1H-pyraz...)
Affinity DataIC50:  2.10E+4nM. Assay description: Human: Activated ERK2 activity was determined in an IMAP-FP assay (Molecular Devices). Using this assay format, the potency (IC50) of each compound w...
Ligand InfoPC cidPC sid
In DepthDetails US Patent
TargetMitogen-activated protein kinase 1(Homo sapiens (Human))
Merck Sharp & Dohme
US Patent
LigandPNGBDBM272568((R)-3-amino-6-(1-phenylethyl)-5,6-dihydro-1H-pyraz...)
Affinity DataIC50:  45nM. Assay description: Activated ERK2 activity was determined in an IMAP-FP assay (Molecular Devices). Using this assay format, the potency (IC50) of each compound was dete...
Ligand InfoPC cidPC sid
In DepthDetails US Patent