BDBM272994 (R)-2-(4-(1-(2- aminothiazolo[5,4- b]pyridin-5-yl)- 7,8,9,10-tetrahydro-6- oxa-2,10a- diazacycloocta[cd]inden- 4-yl)-1H-pyrazol-1- yl)butanamide::US10065970, Example 299::US10435414, Example 299
SMILES CC[C@H](C(N)=O)n1cc(cn1)-c1cc2OCCCCn3c(nc(c1)c23)-c1ccc2nc(N)sc2n1
InChI Key InChIKey=WUHRUVRFMAVOHR-GOSISDBHSA-N
Data  2 KI
  Tab Delimited (TSV)   2D SDfile   Computed 3D by Vconf -m prep SDfile
Find this compound or compounds like it in BindingDB:
Activity Spreadsheet -- Enzyme Inhibition Constant Data from BindingDB
Found 2 hits for monomerid = 272994
TargetPhosphatidylinositol 3-kinase regulatory subunit alpha(Homo sapiens (Human))
Genentech
US Patent
LigandPNGBDBM272994((R)-2-(4-(1-(2- aminothiazolo[5,4- b]pyridin-5-yl)...)
Affinity DataKi:  0.0610nM. Assay description: TBD
Ligand InfoPC cidPC sid
In DepthDetails US Patent
LigandPNGBDBM272994((R)-2-(4-(1-(2- aminothiazolo[5,4- b]pyridin-5-yl)...)
Affinity DataKi:  0.0610nM. Assay description: PI3K Binding assays are intended for determining the biochemical potency of small molecule PI3K inhibitors. The PI3K lipid kinase reaction is perform...
Ligand InfoPC cidPC sid
In DepthDetails US Patent