BDBM273064 (R)-N-((R)-indan-1-yl)-2-[5-oxo-7-(propan-2-yl)-5H-[1,3,4]thiadiazolo[3,2-a]pyrimidin-2-yl]pyrrolidine-1-carboxamide::US10065972, Example 168
SMILES CC(C)c1cc(=O)n2nc(sc2n1)[C@H]1CCCN1C(=O)N[C@@H]1CCc2ccccc12
InChI Key InChIKey=RLGBLRRNIXLHMA-SJLPKXTDSA-N
Data  1 IC50
  Tab Delimited (TSV)   2D SDfile   Computed 3D by Vconf -m prep SDfile
Find this compound or compounds like it in BindingDB:
Activity Spreadsheet -- Enzyme Inhibition Constant Data from BindingDB
Found 1 hit for monomerid = 273064
TargetKynurenine/alpha-aminoadipate aminotransferase, mitochondrial(Homo sapiens (Human))
Mitsubishi Tanabe Pharma
US Patent
LigandPNGBDBM273064((R)-N-((R)-indan-1-yl)-2-[5-oxo-7-(propan-2-yl)-5H...)
Affinity DataIC50:  410nMpH: 8.0Assay Description:The inhibitory action of the test compound on human recombinant KAT-II was determined by the following method.To a reaction mixture (45 μL) cont...
Ligand InfoPC cidPC sid
In DepthDetails US Patent