BDBM273067 (R)-2-(6,7-dimethyl-5-oxo-5H-[1,3,4]thiadiazolo[3,2-a]pyrimidin-2-yl)-N-(1-methyl-1-phenylethyl)pyrrolidine-1-carboxamide::US10065972, Example 172
SMILES Cc1nc2sc(nn2c(=O)c1C)[C@H]1CCCN1C(=O)NC(C)(C)c1ccccc1
InChI Key InChIKey=LUVUYTKDDNPCQS-MRXNPFEDSA-N
Data  1 IC50
  Tab Delimited (TSV)   2D SDfile   Computed 3D by Vconf -m prep SDfile
Find this compound or compounds like it in BindingDB:
Activity Spreadsheet -- Enzyme Inhibition Constant Data from BindingDB
Found 1 hit for monomerid = 273067
TargetKynurenine/alpha-aminoadipate aminotransferase, mitochondrial(Homo sapiens (Human))
Mitsubishi Tanabe Pharma
US Patent
LigandPNGBDBM273067((R)-2-(6,7-dimethyl-5-oxo-5H-[1,3,4]thiadiazolo[3,...)
Affinity DataIC50:  840nMpH: 8.0Assay Description:The inhibitory action of the test compound on human recombinant KAT-II was determined by the following method.To a reaction mixture (45 μL) cont...
Ligand InfoPC cidPC sid
In DepthDetails US Patent