BDBM273100 (R)-N-[(R)-cyclopropyl(phenyl)methyl]-1-(5-difluoromethyl-6-ethyl-7-oxo-6,7-dihydro-[1,3]thiazolo[5,4-d]pyrimidin-2-yl)pyrrolidine-2-carboxamide::US10065972, Example 299
SMILES CCn1c(nc2sc(nc2c1=O)N1CCC[C@@H]1C(=O)N[C@H](C1CC1)c1ccccc1)C(F)F
InChI Key InChIKey=OKJOQFITQTXCII-CVEARBPZSA-N
Data  1 IC50
  Tab Delimited (TSV)   2D SDfile   Computed 3D by Vconf -m prep SDfile
Find this compound or compounds like it in BindingDB:
Activity Spreadsheet -- Enzyme Inhibition Constant Data from BindingDB
Found 1 hit for monomerid = 273100
TargetKynurenine/alpha-aminoadipate aminotransferase, mitochondrial(Homo sapiens (Human))
Mitsubishi Tanabe Pharma
US Patent
LigandPNGBDBM273100((R)-N-[(R)-cyclopropyl(phenyl)methyl]-1-(5-difluor...)
Affinity DataIC50:  460nMpH: 8.0Assay Description:The inhibitory action of the test compound on human recombinant KAT-II was determined by the following method.To a reaction mixture (45 μL) cont...
Ligand InfoPC cidPC sid
In DepthDetails US Patent