BDBM273165 (R)-N-benzyl-1-(4-oxo-7-trifluoromethyl-4,5-dihydro[1,3]thiazolo[4,5-c]pyridin-2-yl)pyrrolidine-2-carboxamide::US10065972, Example 617
SMILES FC(F)(F)c1c[nH]c(=O)c2nc(sc12)N1CCC[C@@H]1C(=O)NCc1ccccc1
InChI Key
Data  1 IC50
  Tab Delimited (TSV)   2D SDfile   Computed 3D by Vconf -m prep SDfile
Find this compound or compounds like it in BindingDB:
Activity Spreadsheet -- Enzyme Inhibition Constant Data from BindingDB
Found 1 hit for monomerid = 273165
TargetKynurenine/alpha-aminoadipate aminotransferase, mitochondrial(Homo sapiens (Human))
Mitsubishi Tanabe Pharma
US Patent
LigandPNGBDBM273165((R)-N-benzyl-1-(4-oxo-7-trifluoromethyl-4,5-dihydr...)
Affinity DataIC50:  240nMpH: 8.0Assay Description:The inhibitory action of the test compound on human recombinant KAT-II was determined by the following method.To a reaction mixture (45 μL) cont...
Ligand InfoPC cidPC sid
In DepthDetails US Patent