BDBM2734 (1R,2R)-N-[cis-2-(6-Fluoro-2-hydroxy-3-propionylphenyl)cyclopropyl]-N-[2-(5-chloropyridyl)]urea::1-(5-chloropyridin-2-yl)-3-[(1R,2R)-2-(6-fluoro-2-hydroxy-3-propanoylphenyl)cyclopropyl]urea::urea-PETT deriv. 19
SMILES CCC(=O)c1ccc(F)c([C@H]2C[C@H]2NC(=O)Nc2ccc(Cl)cn2)c1O
InChI Key InChIKey=LSOMQLHUCGDDFP-WCQYABFASA-N
Data  3 IC50
  Tab Delimited (TSV)   2D SDfile   Computed 3D by Vconf -m prep SDfile
Find this compound or compounds like it in BindingDB:
Activity Spreadsheet -- Enzyme Inhibition Constant Data from BindingDB
Found 3 hits for monomerid = 2734
TargetGag-Pol polyprotein [588-1027]/[588-1147](Human immunodeficiency virus type 1)
Medivir
LigandPNGBDBM2734((1R,2R)-N-[cis-2-(6-Fluoro-2-hydroxy-3-propionylph...)
Affinity DataIC50:  3.20nM. Assay description: The IC50 of reverse transcriptase is the concentration that inhibits 50% of recombinant HIV-1 RT RNA-directed DNA polymerase activity in vitro.
In DepthDetails ArticlePubMed
TargetGag-Pol polyprotein [588-1027,K690N]/[588-1147,K690N](Human immunodeficiency virus type 1)
Medivir
LigandPNGBDBM2734((1R,2R)-N-[cis-2-(6-Fluoro-2-hydroxy-3-propionylph...)
Affinity DataIC50:  82nM. Assay description: The IC50 of reverse transcriptase is the concentration that inhibits 50% of recombinant HIV-1 RT RNA-directed DNA polymerase activity in vitro.
In DepthDetails ArticlePubMed
TargetGag-Pol polyprotein [588-1127,Y768C]/[588-1147,Y768C](Human immunodeficiency virus type 1)
Medivir
LigandPNGBDBM2734((1R,2R)-N-[cis-2-(6-Fluoro-2-hydroxy-3-propionylph...)
Affinity DataIC50:  19nM. Assay description: The IC50 of reverse transcriptase is the concentration that inhibits 50% of recombinant HIV-1 RT RNA-directed DNA polymerase activity in vitro.
In DepthDetails ArticlePubMed