BDBM273691 US10071079, Example 476::US10478424, Example 476
SMILES CC(C)c1c([nH]c2ccc(cc12)C1CCN(CC1)C(C#N)C1(C)COC1)-c1cn2ncnc2c(C)c1C
InChI Key
Data  6 IC50
  Tab Delimited (TSV)   2D SDfile   Computed 3D by Vconf -m prep SDfile
Find this compound or compounds like it in BindingDB:
Activity Spreadsheet -- Enzyme Inhibition Constant Data from BindingDB
Found 6 hits for monomerid = 273691
TargetToll-like receptor 7(Homo sapiens (Human))
Bristol-Myers Squibb
US Patent
LigandPNGBDBM273691(US10071079, Example 476 | US10478424, Example 476)
Affinity DataIC50:  0.400nMT: 2°C. Assay description: HEK-Blue-cells (Invivogen) overexpressing human TLR7, TLR8 or TLR9 receptors were used for screening inhibitors of these receptors using an inducible...
Ligand InfoPC cidPC sid
In DepthDetails US Patent
TargetToll-like receptor 8(Homo sapiens (Human))
Bristol-Myers Squibb
US Patent
LigandPNGBDBM273691(US10071079, Example 476 | US10478424, Example 476)
Affinity DataIC50:  0.800nMT: 2°C. Assay description: HEK-Blue-cells (Invivogen) overexpressing human TLR7, TLR8 or TLR9 receptors were used for screening inhibitors of these receptors using an inducible...
Ligand InfoPC cidPC sid
In DepthDetails US Patent
TargetToll-like receptor 9(Homo sapiens (Human))
Bristol-Myers Squibb
US Patent
LigandPNGBDBM273691(US10071079, Example 476 | US10478424, Example 476)
Affinity DataIC50:  1.36E+3nM. Assay description: HEK-Blue-cells (Invivogen) overexpressing human TLR7, TLR8 or TLR9 receptors were used for screening inhibitors of these receptors using an inducible...
Ligand InfoPC cidPC sid
In DepthDetails US Patent
TargetToll-like receptor 7(Homo sapiens (Human))
Bristol-Myers Squibb
US Patent
LigandPNGBDBM273691(US10071079, Example 476 | US10478424, Example 476)
Affinity DataIC50:  0.400nM. Assay description: HEK-Blue-cells (Invivogen) overexpressing human TLR7, TLR8 or TLR9 receptors were used for screening inhibitors of these receptors using an inducible...
Ligand InfoPC cidPC sid
In DepthDetails US Patent
TargetToll-like receptor 8(Homo sapiens (Human))
Bristol-Myers Squibb
US Patent
LigandPNGBDBM273691(US10071079, Example 476 | US10478424, Example 476)
Affinity DataIC50:  0.800nM. Assay description: HEK-Blue-cells (Invivogen) overexpressing human TLR7, TLR8 or TLR9 receptors were used for screening inhibitors of these receptors using an inducible...
Ligand InfoPC cidPC sid
In DepthDetails US Patent
TargetToll-like receptor 9(Homo sapiens (Human))
Bristol-Myers Squibb
US Patent
LigandPNGBDBM273691(US10071079, Example 476 | US10478424, Example 476)
Affinity DataIC50:  1.36E+3nMT: 2°C. Assay description: HEK-Blue-cells (Invivogen) overexpressing human TLR7, TLR8 or TLR9 receptors were used for screening inhibitors of these receptors using an inducible...
Ligand InfoPC cidPC sid
In DepthDetails US Patent