BDBM274255 6-(4-chlorophenyl)-5-(1,5-dimethyl-6-oxo-1,6-dihydropyridin-3-yl)-1-methyl-2-(pyridin-2-yl)-5,6-dihydropyrrolo[3,4-b]pyrrol-4(1H)-one::US9550796, Example 52
SMILES Cc1cc(cn(C)c1=O)N1C(c2c(cc(-c3ccccn3)n2C)C1=O)c1ccc(Cl)cc1
InChI Key InChIKey=LWGUCDPMTIPABX-UHFFFAOYSA-N
Data  4 IC50
  Tab Delimited (TSV)   2D SDfile   Computed 3D by Vconf -m prep SDfile
Find this compound or compounds like it in BindingDB:
Activity Spreadsheet -- Enzyme Inhibition Constant Data from BindingDB
Found 4 hits for monomerid = 274255
TargetBromodomain-containing protein 4 [44-477](Homo sapiens (Human))
Novartis
US Patent
LigandPNGBDBM274255(6-(4-chlorophenyl)-5-(1,5-dimethyl-6-oxo-1,6-dihyd...)
Affinity DataIC50:  55.3nMpH: 7.5Assay Description:All assays were performed in 384-well microtiter plates. Each assay plate contained 8-point serial dilutions for 40 test compounds, plus 16 high- and...
Ligand InfoPC cidPC sid
In DepthDetails US Patent
TargetCREB-binding protein(Homo sapiens (Human))
Novartis
US Patent
LigandPNGBDBM274255(6-(4-chlorophenyl)-5-(1,5-dimethyl-6-oxo-1,6-dihyd...)
Affinity DataIC50:  720nMpH: 7.5 T: 2°C. Assay description: All assays were performed in 384-well microtiter plates. Each assay plate contained 8-point serial dilutions for 40 test compounds, plus 16 high- and...
Ligand InfoPC cidPC sid
In DepthDetails US Patent
TargetBromodomain-containing protein 3(Homo sapiens (Human))
Novartis
US Patent
LigandPNGBDBM274255(6-(4-chlorophenyl)-5-(1,5-dimethyl-6-oxo-1,6-dihyd...)
Affinity DataIC50:  54nMpH: 7.5Assay Description:All assays were performed in 384-well microtiter plates. Each assay plate contained 8-point serial dilutions for 40 test compounds, plus 16 high- and...
Ligand InfoPC cidPC sid
In DepthDetails US Patent
TargetBromodomain-containing protein 2 [60-463](Homo sapiens (Human))
Novartis
US Patent
LigandPNGBDBM274255(6-(4-chlorophenyl)-5-(1,5-dimethyl-6-oxo-1,6-dihyd...)
Affinity DataIC50:  67nMpH: 7.5Assay Description:All assays were performed in 384-well microtiter plates. Each assay plate contained 8-point serial dilutions for 40 test compounds, plus 16 high- and...
Ligand InfoPC cidPC sid
In DepthDetails US Patent