BDBM274423 US95556117, Example 87,4-Chloro-7-(2-hydroxy-ethoxy)-1H-indole-5-carboxylic acid (4,4-difluoro-1-hydroxy-cyclohexylmethyl)-amide
SMILES OCCOc1cc(C(=O)NCC2(O)CCC(F)(F)CC2)c(Cl)c2cc[nH]c12
InChI Key InChIKey=GFAKTQPNESPYCU-UHFFFAOYSA-N
Data  1 IC50
  Tab Delimited (TSV)   2D SDfile   Computed 3D by Vconf -m prep SDfile
Find this compound or compounds like it in BindingDB:
Activity Spreadsheet -- Enzyme Inhibition Constant Data from BindingDB
Found 1 hit for monomerid = 274423
TargetP2X purinoceptor 7(Homo sapiens (Human))
Actelion Pharmaceuticals
US Patent
LigandPNGBDBM274423(US95556117, Example 87,4-Chloro-7-(2-hydroxy-ethox...)
Affinity DataIC50:  7.30nM. Assay description: The amplified sequence was subsequently ligated into a pcDNA3.1 (+) NotI, NheI digested plasmid. Human embryonic kidney (HEK) cells (ATCC CRL-1573, M...
Ligand InfoPC cidPC sid
In DepthDetails US Patent