BDBM27452 5-(5,6-dimethoxy-1H-1,3-benzodiazol-1-yl)-3-[(2-methanesulfonylphenyl)methoxy]thiophene-2-carbonitrile::benzimidazole-thiophene carbonitrile, 12e
SMILES COc1cc2ncn(-c3cc(OCc4ccccc4S(C)(=O)=O)c(s3)C#N)c2cc1OC
InChI Key InChIKey=LDTAHRLHGHFHKP-UHFFFAOYSA-N
Data  9 IC50
  Tab Delimited (TSV)   2D SDfile   Computed 3D by Vconf -m prep SDfile
Find this compound or compounds like it in BindingDB:
Activity Spreadsheet -- Enzyme Inhibition Constant Data from BindingDB
Found 9 hits for monomerid = 27452
LigandPNGBDBM27452(5-(5,6-dimethoxy-1H-1,3-benzodiazol-1-yl)-3-[(2-me...)
Affinity DataIC50:  40nMpH: 7.4 T: 2°C. Assay description: IKK kinase activity was assessed using a time-resolved fluorescence resonance energy transfer (TR-FRET) assay. The reaction was initiated by the addi...
In DepthDetails ArticlePubMed
LigandPNGBDBM27452(5-(5,6-dimethoxy-1H-1,3-benzodiazol-1-yl)-3-[(2-me...)
Affinity DataIC50: >1.58E+4nMpH: 7.4 T: 2°C. Assay description: IKK kinase activity was assessed using a time-resolved fluorescence resonance energy transfer (TR-FRET) assay. The reaction was initiated by the addi...
In DepthDetails ArticlePubMed
TargetSerine/threonine-protein kinase PLK1(Homo sapiens (Human))
Gsk
LigandPNGBDBM27452(5-(5,6-dimethoxy-1H-1,3-benzodiazol-1-yl)-3-[(2-me...)
Affinity DataIC50:  794nMpH: 7.2 T: 2°C. Assay description: The compound inhibitory activity was determined by incubation with purified PLK1 and biotinylated peptide substrate in the presence ATP/[gamma-33P]AT...
In DepthDetails ArticlePubMed
LigandPNGBDBM27452(5-(5,6-dimethoxy-1H-1,3-benzodiazol-1-yl)-3-[(2-me...)
Affinity DataIC50: >1.58E+4nMpH: 7.4 T: 2°C. Assay description: IKK kinase activity was assessed using a time-resolved fluorescence resonance energy transfer (TR-FRET) assay. The reaction was initiated by the addi...
In DepthDetails ArticlePubMed
TargetSerine/threonine-protein kinase TBK1(Homo sapiens (Human))
Astrazeneca
Curated by ChEMBL
LigandPNGBDBM27452(5-(5,6-dimethoxy-1H-1,3-benzodiazol-1-yl)-3-[(2-me...)
Affinity DataIC50:  72nM. Assay description: Inhibition of TBK1 in HEK293 cells after 4.5 hrs by ISRE-luciferase reporter gene assay in presence of poly I:C
In DepthDetails ArticlePubMed
TargetCyclin-dependent kinase 2(Homo sapiens (Human))
Astrazeneca
Curated by ChEMBL
LigandPNGBDBM27452(5-(5,6-dimethoxy-1H-1,3-benzodiazol-1-yl)-3-[(2-me...)
Affinity DataIC50: >3.00E+4nM. Assay description: Inhibition of CDK2 (unknown origin)
In DepthDetails ArticlePubMed
LigandPNGBDBM27452(5-(5,6-dimethoxy-1H-1,3-benzodiazol-1-yl)-3-[(2-me...)
Affinity DataIC50:  469nM. Assay description: Inhibition of IKK-epsilon (unknown origin) using 5FAM-AKELDQGSLCTpSFVGTLQ-NH2 as substrate by microfluidic mobility shift assay
In DepthDetails ArticlePubMed
TargetSerine/threonine-protein kinase TBK1(Homo sapiens (Human))
Astrazeneca
Curated by ChEMBL
LigandPNGBDBM27452(5-(5,6-dimethoxy-1H-1,3-benzodiazol-1-yl)-3-[(2-me...)
Affinity DataIC50:  93nM. Assay description: Inhibition of recombinant full-length TBK1 (unknown origin) using CK1tide as substrate by microfluidic mobility shift assay
In DepthDetails ArticlePubMed
TargetAurora kinase B(Homo sapiens (Human))
Astrazeneca
Curated by ChEMBL
LigandPNGBDBM27452(5-(5,6-dimethoxy-1H-1,3-benzodiazol-1-yl)-3-[(2-me...)
Affinity DataIC50: >5.32E+3nM. Assay description: Inhibition of aurora B (unknown origin)
In DepthDetails ArticlePubMed