BDBM27460 2-amino-5-(4-fluorophenyl)-3-(4-methanesulfonylphenyl)-N-methylbenzamide::Amino-substituted diarylbenzamide, 8a
SMILES CNC(=O)c1cc(cc(c1N)-c1ccc(cc1)S(C)(=O)=O)-c1ccc(F)cc1
InChI Key InChIKey=PEAZARIFDFJHCX-UHFFFAOYSA-N
Data  3 IC50
  Tab Delimited (TSV)   2D SDfile   Computed 3D by Vconf -m prep SDfile
Find this compound or compounds like it in BindingDB:
Activity Spreadsheet -- Enzyme Inhibition Constant Data from BindingDB
Found 3 hits for monomerid = 27460
LigandPNGBDBM27460(2-amino-5-(4-fluorophenyl)-3-(4-methanesulfonylphe...)
Affinity DataIC50: >1.58E+4nMpH: 7.4 T: 2°C. Assay description: IKK kinase activity was assessed using a time-resolved fluorescence resonance energy transfer (TR-FRET) assay. The reaction was initiated by the addi...
Ligand InfoPC cidPC sid
In DepthDetails ArticlePubMed
TargetInhibitor of nuclear factor kappa-B kinase subunit beta(Homo sapiens (Human))
China Pharmaceutical University
Curated by ChEMBL
LigandPNGBDBM27460(2-amino-5-(4-fluorophenyl)-3-(4-methanesulfonylphe...)
Affinity DataIC50:  1.58E+4nM. Assay description: Inhibition of human IKKbeta using GST-IkappaBalpha as substrate
Ligand InfoPC cidPC sid
In DepthDetails ArticlePubMed
TargetInhibitor of nuclear factor kappa-B kinase subunit beta(Homo sapiens (Human))
China Pharmaceutical University
Curated by ChEMBL
LigandPNGBDBM27460(2-amino-5-(4-fluorophenyl)-3-(4-methanesulfonylphe...)
Affinity DataIC50: >1.58E+4nM. Assay description: IKK kinase activity was assessed using a time-resolved fluorescence resonance energy transfer (TR-FRET) assay. The reaction was initiated by the addi...
Ligand InfoPC cidPC sid
In DepthDetails ArticlePubMed