BDBM274708 N-(6-(4-(4-fluorophenyl)-1-methyl-1H- imidazol-5-yl)imidazo[1,2-b]pyridazin-2- yl)pivalamide::US9556179, Compound 283
SMILES Cn1cnc(c1-c1ccc2nc(NC(=O)C(C)(C)C)cn2n1)-c1ccc(F)cc1
InChI Key InChIKey=WEJNVTWQSQPSQX-UHFFFAOYSA-N
Data  2 IC50
  Tab Delimited (TSV)   2D SDfile   Computed 3D by Vconf -m prep SDfile
Find this compound or compounds like it in BindingDB:
Activity Spreadsheet -- Enzyme Inhibition Constant Data from BindingDB
Found 2 hits for monomerid = 274708
TargetCasein kinase I isoform delta(Homo sapiens (Human))
Bristol-Myers Squibb
US Patent
LigandPNGBDBM274708(N-(6-(4-(4-fluorophenyl)-1-methyl-1H- imidazol-5-y...)
Affinity DataIC50:  0.545nMpH: 7.4 T: 2°C. Assay description: The kinase assay was performed in V-bottom 384-well plates. The final assay volume was 30 μl prepared from 15 μl additions of enzyme, subst...
Ligand InfoPC cidPC sid
In DepthDetails US Patent
TargetCasein kinase I isoform epsilon(Homo sapiens (Human))
Bristol-Myers Squibb
US Patent
LigandPNGBDBM274708(N-(6-(4-(4-fluorophenyl)-1-methyl-1H- imidazol-5-y...)
Affinity DataIC50:  7.62nMpH: 7.4 T: 2°C. Assay description: The kinase assay was performed in V-bottom 384-well plates. The final assay volume was 30 μl prepared from 15 μl additions of enzyme, subst...
Ligand InfoPC cidPC sid
In DepthDetails US Patent