BDBM274752 N-(6-(4-(4-fluorophenyl)-1,2- dimethyl-1H-imidazol-5-yl) imidazo[1,2-b]pyridazin-2- yl)-5-quinolinecarboxamide::US9556179, Compound 327::US9556179, Compound 328
SMILES Cc1nc(c(-c2ccc3nc(NC(=O)c4cccc5ncccc45)cn3n2)n1C)-c1ccc(F)cc1
InChI Key InChIKey=XRLWUFAKRWKETA-UHFFFAOYSA-N
Data  4 IC50
  Tab Delimited (TSV)   2D SDfile   Computed 3D by Vconf -m prep SDfile
Find this compound or compounds like it in BindingDB:
Activity Spreadsheet -- Enzyme Inhibition Constant Data from BindingDB
Found 4 hits for monomerid = 274752
TargetCasein kinase I isoform epsilon(Homo sapiens (Human))
Bristol-Myers Squibb
US Patent
LigandPNGBDBM274752(N-(6-(4-(4-fluorophenyl)-1,2- dimethyl-1H-imidazol...)
Affinity DataIC50:  6.08nMpH: 7.4 T: 2°C. Assay description: The kinase assay was performed in V-bottom 384-well plates. The final assay volume was 30 μl prepared from 15 μl additions of enzyme, subst...
Ligand InfoPC cidPC sid
In DepthDetails US Patent
TargetCasein kinase I isoform delta(Homo sapiens (Human))
Bristol-Myers Squibb
US Patent
LigandPNGBDBM274752(N-(6-(4-(4-fluorophenyl)-1,2- dimethyl-1H-imidazol...)
Affinity DataIC50:  0.335nMpH: 7.4 T: 2°C. Assay description: The kinase assay was performed in V-bottom 384-well plates. The final assay volume was 30 μl prepared from 15 μl additions of enzyme, subst...
Ligand InfoPC cidPC sid
In DepthDetails US Patent
TargetCasein kinase I isoform epsilon(Homo sapiens (Human))
Bristol-Myers Squibb
US Patent
LigandPNGBDBM274752(N-(6-(4-(4-fluorophenyl)-1,2- dimethyl-1H-imidazol...)
Affinity DataIC50:  2.13nMpH: 7.4 T: 2°C. Assay description: The kinase assay was performed in V-bottom 384-well plates. The final assay volume was 30 μl prepared from 15 μl additions of enzyme, subst...
Ligand InfoPC cidPC sid
In DepthDetails US Patent
TargetCasein kinase I isoform delta(Homo sapiens (Human))
Bristol-Myers Squibb
US Patent
LigandPNGBDBM274752(N-(6-(4-(4-fluorophenyl)-1,2- dimethyl-1H-imidazol...)
Affinity DataIC50:  0.676nMpH: 7.4 T: 2°C. Assay description: The kinase assay was performed in V-bottom 384-well plates. The final assay volume was 30 μl prepared from 15 μl additions of enzyme, subst...
Ligand InfoPC cidPC sid
In DepthDetails US Patent