BDBM274909 3-(2-(2- Fluoroisonicotinamido) imidazo[1,2- b]pyridazin-6-yl)-2- (4-fluorophenyl)-N-(1- (trifluoromethyl)cyclopropyl)-5,6- dihydroimidazo[1,2- a]pyrazine-7(8H)- carboxamide::US9556179, Compound 487
SMILES Fc1ccc(cc1)-c1nc2CN(CCn2c1-c1ccc2nc(NC(=O)c3ccnc(F)c3)cn2n1)C(=O)NC1(CC1)C(F)(F)F
InChI Key InChIKey=NMYSDIGQFVEZMK-UHFFFAOYSA-N
Data  2 IC50
  Tab Delimited (TSV)   2D SDfile   Computed 3D by Vconf -m prep SDfile
Find this compound or compounds like it in BindingDB:
Activity Spreadsheet -- Enzyme Inhibition Constant Data from BindingDB
Found 2 hits for monomerid = 274909
TargetCasein kinase I isoform delta(Homo sapiens (Human))
Bristol-Myers Squibb
US Patent
LigandPNGBDBM274909(3-(2-(2- Fluoroisonicotinamido) imidazo[1,2- b]pyr...)
Affinity DataIC50:  0.400nMpH: 7.4 T: 2°C. Assay description: The kinase assay was performed in V-bottom 384-well plates. The final assay volume was 30 μl prepared from 15 μl additions of enzyme, subst...
Ligand InfoPC cidPC sid
In DepthDetails US Patent
TargetCasein kinase I isoform epsilon(Homo sapiens (Human))
Bristol-Myers Squibb
US Patent
LigandPNGBDBM274909(3-(2-(2- Fluoroisonicotinamido) imidazo[1,2- b]pyr...)
Affinity DataIC50:  5.10nMpH: 7.4 T: 2°C. Assay description: The kinase assay was performed in V-bottom 384-well plates. The final assay volume was 30 μl prepared from 15 μl additions of enzyme, subst...
Ligand InfoPC cidPC sid
In DepthDetails US Patent