BDBM274986 N2-(tert-butyl)-N8-(2-(2-methylimidazo[2,1- b][1,3,4]thiadiazol-6-yl)ethyl)-5-(3- (trifluoromethyl)phenyl)-3,4- dihydroisoquinoline-2,8(1H)-dicarboxamide::US9877957, Example 25
SMILES Cc1nn2cc(CCNC(=O)c3ccc(-c4cccc(c4)C(F)(F)F)c4CCN(Cc34)C(=O)NC(C)(C)C)nc2s1
InChI Key InChIKey=HCBRMZOYIAUILB-UHFFFAOYSA-N
Data  1 IC50
  Tab Delimited (TSV)   2D SDfile   Computed 3D by Vconf -m prep SDfile
Find this compound or compounds like it in BindingDB:
Activity Spreadsheet -- Enzyme Inhibition Constant Data from BindingDB
Found 1 hit for monomerid = 274986
TargetDiacylglycerol O-acyltransferase 2(Homo sapiens (Human))
Merck Sharp & Dohme
US Patent
LigandPNGBDBM274986(N2-(tert-butyl)-N8-(2-(2-methylimidazo[2,1- b][1,3...)
Affinity DataIC50:  271nMpH: 7.0 T: 2°C. Assay description: DGAT2 activity was determined by measuring the amount of enzymatic product triolein (1,2,3-Tri(cis-9-octadecenoyl)glycerol) using the membrane prep m...
Ligand InfoPC cidPC sid
In DepthDetails US Patent