BDBM275 (3S)-4-oxo-3-[(6-{[3-(1H-1,2,3,4-tetrazol-5-yl)benzene]sulfonamidomethyl}pyridin-3-yl)formamido]butanoic acid::(S)-4-Oxo-3-[(6-{[3-(1H-tetrazol-5-yl)benzenesulfonylamino]methyl}pyridine-3-carbonyl)amino]butyric Acid Trifluoroacetate::Inhibitor 56::Pyridine Scaffold 56
SMILES OC(=O)C[C@H](NC(=O)c1ccc(CNS(=O)(=O)c2cccc(c2)-c2nnn[nH]2)nc1)C=O
InChI Key InChIKey=DWMVUTWXNPMAGJ-AWEZNQCLSA-N
Data  1 KI
  Tab Delimited (TSV)   2D SDfile   Computed 3D by Vconf -m prep SDfile
Find this compound or compounds like it in BindingDB:
Activity Spreadsheet -- Enzyme Inhibition Constant Data from BindingDB
Found 1 hit for monomerid = 275
TargetCaspase-3(Homo sapiens (Human))
Sunesis Pharmaceuticals
LigandPNGBDBM275((3S)-4-oxo-3-[(6-{[3-(1H-1,2,3,4-tetrazol-5-yl)ben...)
Affinity DataKi:  440nM ΔG°:  -8.67kcal/molepH: 7.4 T: 2°C. Assay description: The effectiveness of compounds against the activity of human recombinant caspase-1-8 was measured using fluorometric assays. Assays were carried out ...
In DepthDetails ArticlePubMed