BDBM275006 N8-(2-(1H-pyrazol-1-yl)propyl)-N2-(tert- butyl)-5-(3-(trifluoromethyl)phenyl)-3,4- dihydroisoquinoline-2,8(1H)-dicarboxamide::US9877957, Example 44
SMILES CC(CNC(=O)c1ccc(-c2cccc(c2)C(F)(F)F)c2CCN(Cc12)C(=O)NC(C)(C)C)n1cccn1
InChI Key InChIKey=ZFPHAZCLWJPADA-UHFFFAOYSA-N
Data  1 IC50
  Tab Delimited (TSV)   2D SDfile   Computed 3D by Vconf -m prep SDfile
Find this compound or compounds like it in BindingDB:
Activity Spreadsheet -- Enzyme Inhibition Constant Data from BindingDB
Found 1 hit for monomerid = 275006
TargetDiacylglycerol O-acyltransferase 2(Homo sapiens (Human))
Merck Sharp & Dohme
US Patent
LigandPNGBDBM275006(N8-(2-(1H-pyrazol-1-yl)propyl)-N2-(tert- butyl)-5-...)
Affinity DataIC50:  1.20E+3nMpH: 7.0 T: 2°C. Assay description: DGAT2 activity was determined by measuring the amount of enzymatic product triolein (1,2,3-Tri(cis-9-octadecenoyl)glycerol) using the membrane prep m...
Ligand InfoPC cidPC sid
In DepthDetails US Patent