BDBM275044 N2-(tert-butyl)-N8-(pyrazolo[1,5-a]pyridin-3- ylmethyl)-5-(3-(trifluoromethoxy)phenyl)- 3,4-dihydroisoquinoline-2,8(1H)- dicarboxamide::US9877957, Example 81
SMILES CC(C)(C)NC(=O)N1CCc2c(C1)c(ccc2-c1cccc(OC(F)(F)F)c1)C(=O)NCc1cnn2ccccc12
InChI Key InChIKey=CMPJZGOTUYAEGC-UHFFFAOYSA-N
Data  1 IC50
  Tab Delimited (TSV)   2D SDfile   Computed 3D by Vconf -m prep SDfile
Find this compound or compounds like it in BindingDB:
Activity Spreadsheet -- Enzyme Inhibition Constant Data from BindingDB
Found 1 hit for monomerid = 275044
TargetDiacylglycerol O-acyltransferase 2(Homo sapiens (Human))
Merck Sharp & Dohme
US Patent
LigandPNGBDBM275044(N2-(tert-butyl)-N8-(pyrazolo[1,5-a]pyridin-3- ylme...)
Affinity DataIC50:  370nMpH: 7.0 T: 2°C. Assay description: DGAT2 activity was determined by measuring the amount of enzymatic product triolein (1,2,3-Tri(cis-9-octadecenoyl)glycerol) using the membrane prep m...
Ligand InfoPC cidPC sid
In DepthDetails US Patent