BDBM275139 1-[1-(2-methyl-2H-indazol- 5-yl)-1H-pyrazolo[3,4- c]pyridin-5-yl]-3-[1,3 oxazol-5- yl(phenyl)methyl]urea::US9884048, Example 35
SMILES Cn1cc2cc(ccc2n1)-n1ncc2cc(NC(=O)NC(c3cnco3)c3ccccc3)ncc12
InChI Key InChIKey=CHQCXVLJBXMQKK-UHFFFAOYSA-N
Data  1 IC50
  Tab Delimited (TSV)   2D SDfile   Computed 3D by Vconf -m prep SDfile
Find this compound or compounds like it in BindingDB:
Activity Spreadsheet -- Enzyme Inhibition Constant Data from BindingDB
Found 1 hit for monomerid = 275139
TargetMitogen-activated protein kinase 1(Homo sapiens (Human))
Merck Sharp & Dohme
US Patent
LigandPNGBDBM275139(1-[1-(2-methyl-2H-indazol- 5-yl)-1H-pyrazolo[3,4- ...)
Affinity DataIC50:  1.56nM. Assay description: Activated ERK2 activity was determined in an IMAP-FP assay (Molecular Devices). Using this assay format, the potency (IC50) of each compound was dete...
Ligand InfoPC cidPC sid
In DepthDetails US Patent