BDBM275162 1-[(3R)-1-(2-fluoro-6- methoxybenzyl)piperidin-3- yl]-3-[1-(2-methylpyridin-4- yl)-1H-pyrazolo[3,4- c]pyridin-5-yl]urea::US9884048, Example 56
SMILES COc1cccc(F)c1CN1CCC[C@H](C1)NC(=O)Nc1cc2cnn(-c3ccnc(C)c3)c2cn1
InChI Key InChIKey=JCGMQPGTOWBWMM-LJQANCHMSA-N
Data  1 IC50
  Tab Delimited (TSV)   2D SDfile   Computed 3D by Vconf -m prep SDfile
Find this compound or compounds like it in BindingDB:
Activity Spreadsheet -- Enzyme Inhibition Constant Data from BindingDB
Found 1 hit for monomerid = 275162
TargetMitogen-activated protein kinase 1(Homo sapiens (Human))
Merck Sharp & Dohme
US Patent
LigandPNGBDBM275162(1-[(3R)-1-(2-fluoro-6- methoxybenzyl)piperidin-3- ...)
Affinity DataIC50:  0.520nM. Assay description: Activated ERK2 activity was determined in an IMAP-FP assay (Molecular Devices). Using this assay format, the potency (IC50) of each compound was dete...
Ligand InfoPC cidPC sid
In DepthDetails US Patent