BDBM275168 1-(2-amino-1-phenylethyl)- 3-[1-(2-methylpyridin-4-yl)- 1H-pyrazolo[3,4-c]pyridin- 5-yl]urea::US9884048, Example 62
SMILES Cc1cc(ccn1)-n1ncc2cc(NC(=O)NC(CN)c3ccccc3)ncc12
InChI Key InChIKey=UKAOBAIIIFPGGM-UHFFFAOYSA-N
Data  1 IC50
  Tab Delimited (TSV)   2D SDfile   Computed 3D by Vconf -m prep SDfile
Find this compound or compounds like it in BindingDB:
Activity Spreadsheet -- Enzyme Inhibition Constant Data from BindingDB
Found 1 hit for monomerid = 275168
TargetMitogen-activated protein kinase 1(Homo sapiens (Human))
Merck Sharp & Dohme
US Patent
LigandPNGBDBM275168(1-(2-amino-1-phenylethyl)- 3-[1-(2-methylpyridin-4...)
Affinity DataIC50:  0.960nM. Assay description: Activated ERK2 activity was determined in an IMAP-FP assay (Molecular Devices). Using this assay format, the potency (IC50) of each compound was dete...
Ligand InfoPC cidPC sid
In DepthDetails US Patent